{"text_format":"1","workbook":"xlsx","n_sheets":7,"sheets":["0 Quick Start","1 Summary Table","2 Relevance Index","3 Credibility Index (Single)","3 Credibility Index","4 Background & References","Reference Table"],"not_rendered":{"charts":0,"images":0,"macros":1,"external_links":0,"defined_names":1,"comments":1,"pivot_tables":0},"unopened":[],"bounds":{"document_bytes":16777216,"sheet_cells":100000,"rows_first":2000,"rows_last":500,"rows_between":2000,"halvings":0,"cell_chars":16384,"cell_head_chars":4096},"cells_cut":0,"cells_raw":0,"read":"whole","date_system":"1900"}

{"sheet":"0 Quick Start","index":0,"n_rows":10,"n_cols":2,"rows_kept":10,"cut":false,"hidden":false,"merged":[[0,0,0,1]]}
["Relevance and Credibility Indices for Studies of Educational Interventions"]
["Hollands, F. M., Escueta, M.M., Pan, Y., Levin, H. M., Corter, J., & Wang, K. (2019). Relevance and credibility indices for studies of educational interventions. Teachers College, Columbia University."]
["Notes"]
[null,"These indices are currently designed to be used to assess studies which focus on single investigations rather than for studies which summarize the results of many investigations, such as literature reviews or meta-analyses. \n\nWhile such summaries are useful for providing a general idea of “what works,” it would be hard to assess the relevance of an overview study to your own context or to evaluate the credibility of all studies at once.  \n\nYou may wish to identify individual studies included in an overview to which you can apply these indices."]
["Steps to follow"]
[1,"Identify studies you want to evaluate for relevance and credibility."]
[2,"List each study in the tab “1 Summary Table”."]
[3,"Go to the tab “2 Relevance Index” (RI) and complete the worksheet for each study."]
[4,"Go to the tab “3 Credibility Index” (CI) and complete the worksheet for any studies that you found relevant."]
[5,"Return to “1 Summary Table” to review overall results."]

{"sheet":"1 Summary Table","index":1,"n_rows":17,"n_cols":14,"rows_kept":17,"cut":false,"hidden":false,"merged":[[0,0,0,3],[9,0,9,3],[1,0,1,3],[3,0,3,3],[4,0,4,3],[5,0,5,3],[6,0,6,3],[7,0,7,3],[8,0,8,3],[2,0,2,3]]}
["Relevance and Credibility Indices for Studies of Educational Interventions"]
["Instructions (Click add/subtract button in the left-hand margin to expand or collapse the detailed instructions)"]
["1. For first time users, review tab 4 \"Background & References\""]
["2. Fill in Columns B-D with information about the studies you want to evaluate. Column A is optional."]
["3. Proceed to Relevance Index tab and complete the worksheet for each study."]
["4. Return to Summary Table tab. Columns E-G in Summary Table will self-populate based on your inputs in Relevance Index tab."]
["5. In Column H, use the dropdown to indicate whether you want to use this study as relevant evidence."]
["6. Proceed to Credibility Index tab and complete the worksheet for any studies that you found relevant."]
["7. Return to Summary Table tab. Columns I-K will populate based on your inputs in the Credibility Index."]
["8. (Optional) Enter each study's effect size, and decide whether you want to adjust the effect size found in the study for your context using our suggested adjustment factor (“Credibility Parameter”). "]
[]
["Full name of the study \n(Optional)","Nickname of the study\n(This will appear in RI & CI tab as reference while you fill in the worksheets)","Authors","Year of study","Relevance Index","Relevance rating","Recommendation on proceeding to evaluate CI?","Use study as relevant evidence for decision?","Credibility Index","Credibility parameter","Credibility rating","Effect size reported in study","Do you want to adjust the effect size?","Adjusted effect size"]
[null,null,null,null,{"$f":"'2 Relevance Index'!H34","v":""},{"$f":"'2 Relevance Index'!G35","v":""},{"$f":"IF(OR(F13=\"Moderate Relevance\",F13=\"High Relevance\"),\"Yes\",IF(F13=\"Low Relevance\",\"No\",\"\"))","v":""},null,{"$f":"IF('3 Credibility Index'!C66=0,\"\",'3 Credibility Index'!C66)","v":""},{"$f":"IF(I13<10,0.2,IF(I13<20,0.6,IF(I13<=27,1,IF(I13=\"\",\"\",\"\"))))","v":""},{"$f":"IF(J13<=0.2,\"Low Credibility\",IF(J13<=0.6,\"Moderate Credibility\",IF(J13<=1,\"High Credibility\",IF(J13=\"\",\"\"))))","v":""},null,null,{"$f":"IF(M13=\"Yes\",L13*J13,IF(M13=\"No\",\"N.A.\",\"\"))","v":""}]
[null,null,null,null,{"$f":"'2 Relevance Index'!L34","v":""},{"$f":"'2 Relevance Index'!K35","v":""},{"$f":"IF(OR(F14=\"Moderate Relevance\",F14=\"High Relevance\"),\"Yes\",IF(F14=\"Low Relevance\",\"No\",\"\"))","v":""},null,{"$f":"IF('3 Credibility Index'!E66=0,\"\",'3 Credibility Index'!E66)","v":""},{"$f":"IF(I14<10,0.2,IF(I14<20,0.6,IF(I14<=27,1,IF(I14=\"\",\"\",\"\"))))","v":""},{"$f":"IF(J14<=0.2,\"Low Credibility\",IF(J14<=0.6,\"Moderate Credibility\",IF(J14<=1,\"High Credibility\",IF(J14=\"\",\"\"))))","v":""},null,null,{"$f":"IF(M14=\"Yes\",L14*J14,IF(M14=\"No\",\"N.A.\",\"\"))","v":""}]
[null,null,null,null,{"$f":"'2 Relevance Index'!P34","v":""},{"$f":"'2 Relevance Index'!O35","v":""},{"$f":"IF(OR(F15=\"Moderate Relevance\",F15=\"High Relevance\"),\"Yes\",IF(F15=\"Low Relevance\",\"No\",\"\"))","v":""},null,{"$f":"IF('3 Credibility Index'!G66=0,\"\",'3 Credibility Index'!G66)","v":""},{"$f":"IF(I15<10,0.2,IF(I15<20,0.6,IF(I15<=27,1,IF(I15=\"\",\"\",\"\"))))","v":""},{"$f":"IF(J15<=0.2,\"Low Credibility\",IF(J15<=0.6,\"Moderate Credibility\",IF(J15<=1,\"High Credibility\",IF(J15=\"\",\"\"))))","v":""},null,null,""]
[null,null,null,null,{"$f":"'2 Relevance Index'!T34","v":""},{"$f":"'2 Relevance Index'!S35","v":""},{"$f":"IF(OR(F16=\"Moderate Relevance\",F16=\"High Relevance\"),\"Yes\",IF(F16=\"Low Relevance\",\"No\",\"\"))","v":""},null,{"$f":"IF('3 Credibility Index'!I66=0,\"\",'3 Credibility Index'!I66)","v":""},"","",null,null,""]
[null,null,null,null,{"$f":"'2 Relevance Index'!X34","v":""},{"$f":"'2 Relevance Index'!W35","v":""},{"$f":"IF(OR(F17=\"Moderate Relevance\",F17=\"High Relevance\"),\"Yes\",IF(F17=\"Low Relevance\",\"No\",\"\"))","v":""},null,{"$f":"IF('3 Credibility Index'!K66=0,\"\",'3 Credibility Index'!K66)","v":""},"","",null,null,""]

{"sheet":"2 Relevance Index","index":2,"n_rows":36,"n_cols":25,"rows_kept":36,"cut":false,"hidden":false,"merged":[[35,10,35,12],[31,14,32,14],[34,0,34,3],[13,0,18,0],[19,0,25,0],[31,2,32,2],[31,0,32,1],[31,15,32,15],[34,14,34,16],[10,0,10,4],[31,4,32,4],[31,6,32,6],[31,8,32,8],[10,10,10,12],[31,7,32,7],[31,11,32,11],[28,0,30,0],[10,6,10,8],[34,6,34,8],[31,10,32,10],[31,12,32,12],[35,22,35,24],[34,10,34,12],[10,14,10,16],[31,16,32,16],[35,14,35,16],[10,18,10,20],[31,18,32,18],[31,19,32,19],[31,20,32,20],[34,18,34,20],[35,18,35,20],[10,22,10,24],[31,22,32,22],[31,23,32,23],[31,24,32,24],[34,22,34,24],[0,0,0,4],[1,0,1,4],[35,0,35,4],[2,0,2,4],[3,0,3,4],[4,0,4,4],[5,0,5,4],[6,0,6,4],[7,0,7,4],[8,0,8,4],[9,0,9,1]]}
["Relevance and Credibility Indices for Studies of Educational Interventions"]
["Instructions (Click add/subtract button in the left-hand margin to expand or collapse the detailed instructions) "]
["1. Review factors listed in Column B and identify around 5 or 6 important considerations for the specific decision you are using these studies to make."]
["2. Use the dropdown menu in the cells in Column C to indicate how important each of these factors is for this decision context."]
["3. (Optional) Enter details about this factor from your own context in Column E."]
["4. (Optional) Enter information provided in the study about this factor in Column G for the first study."]
["5. Use Column H to indicate how similar the study's context is to yours on this factor."]
["6. Return to Summary Table tab and decide whether you want to use this study as evidence for this decision."]
["7. Repeat steps 4 to 6 for each additional study you review."]
["For a detailed explanation of the calculations used in the RI, click here."]
["General Information",null,null,null,null,null,{"$f":"IF('1 Summary Table'!B13=\"\",\"Please leave this table blank\",'1 Summary Table'!B13)","v":"Please leave this table blank"},null,null,null,{"$f":"IF('1 Summary Table'!B14=\"\",\"Please leave this table blank\",'1 Summary Table'!B14)","v":"Please leave this table blank"},null,null,null,{"$f":"IF('1 Summary Table'!B15=\"\",\"Please leave this table blank\",'1 Summary Table'!B15)","v":"Please leave this table blank"},null,null,null,{"$f":"IF('1 Summary Table'!B16=\"\",\"Please leave this table blank\",'1 Summary Table'!B16)","v":"Please leave this table blank"},null,null,null,{"$f":"IF('1 Summary Table'!B17=\"\",\"Please leave this table blank\",'1 Summary Table'!B17)","v":"Please leave this table blank"}]
["Contextual factor","Things to look for and think about","Important consideration for me* ","Important consideration for me ","Details of my own context",null,"Details of the study","Study context is similar to mine","Study context is similar to mine",null,"Details of the study","Study context is similar to mine","Study context is similar to mine",null,"Details of the study","Study context is similar to mine","Study context is similar to mine",null,"Details of the study","Study context is similar to mine","Study context is similar to mine",null,"Details of the study","Study context is similar to mine","Study context is similar to mine"]
["Recency of study","Extent to which the educational activity, strategy or intervention (Solution Option) is still likely to be applicable in my context today","not at all/unavailable",{"$f":"IF(C13=\"very\",3,IF(C13=\"moderately\",2,IF(C13=\"slightly\",1,IF(C13=\"not at all/unavailable\",0))))","v":0},null,null,null,null,{"$f":"IF(H13=\"very\",3,IF(H13=\"moderately\",2,IF(H13=\"slightly\",1,IF(H13=\"not at all/unavailable\",0))))","v":false},null,null,null,{"$f":"IF(L13=\"very\",3,IF(L13=\"moderately\",2,IF(L13=\"slightly\",1,IF(L13=\"not at all/unavailable\",0))))","v":false},null,null,null,{"$f":"IF(P13=\"very\",3,IF(P13=\"moderately\",2,IF(P13=\"slightly\",1,IF(P13=\"not at all/unavailable\",0))))","v":false},null,null,null,{"$f":"IF(T13=\"very\",3,IF(T13=\"moderately\",2,IF(T13=\"slightly\",1,IF(T13=\"not at all/unavailable\",0))))","v":false},null,null,null,{"$f":"IF(X13=\"very\",3,IF(X13=\"moderately\",2,IF(X13=\"slightly\",1,IF(X13=\"not at all/unavailable\",0))))","v":false}]
["Student demographics","Age of students on which the program/ intervention was tested","not at all/unavailable",{"$f":"IF(C14=\"very\",3,IF(C14=\"moderately\",2,IF(C14=\"slightly\",1,IF(C14=\"not at all/unavailable\",0))))","v":0},null,null,null,null,{"$f":"IF(H14=\"very\",3,IF(H14=\"moderately\",2,IF(H14=\"slightly\",1,IF(H14=\"not at all/unavailable\",0))))","v":false},null,null,null,{"$f":"IF(L14=\"very\",3,IF(L14=\"moderately\",2,IF(L14=\"slightly\",1,IF(L14=\"not at all/unavailable\",0))))","v":false},null,null,null,{"$f":"IF(P14=\"very\",3,IF(P14=\"moderately\",2,IF(P14=\"slightly\",1,IF(P14=\"not at all/unavailable\",0))))","v":false},null,null,null,{"$f":"IF(T14=\"very\",3,IF(T14=\"moderately\",2,IF(T14=\"slightly\",1,IF(T14=\"not at all/unavailable\",0))))","v":false},null,null,null,{"$f":"IF(X14=\"very\",3,IF(X14=\"moderately\",2,IF(X14=\"slightly\",1,IF(X14=\"not at all/unavailable\",0))))","v":false}]
[null,"Baseline performance of students before implementing the program","not at all/unavailable",0,null,null,null,null,false,null,null,null,false,null,null,null,false,null,null,null,false,null,null,null,false]
[null,"Percent economically disadvantaged, e.g., as indicated by FRPL","not at all/unavailable",0,null,null,null,null,false,null,null,null,false,null,null,null,false,null,null,null,false,null,null,null,false]
[null,"Percent classified as minority","not at all/unavailable",0,null,null,null,null,false,null,null,null,false,null,null,null,false,null,null,null,false,null,null,null,false]
[null,"Percent ELL","not at all/unavailable",0,null,null,null,null,false,null,null,null,false,null,null,null,false,null,null,null,false,null,null,null,false]
[null,"Percent Special Education","not at all/unavailable",0,null,null,null,null,false,null,null,null,false,null,null,null,false,null,null,null,false,null,null,null,false]
["School context","Charter school vs. district school vs. private school","not at all/unavailable",0,null,null,null,null,false,null,null,null,false,null,null,null,false,null,null,null,false,null,null,null,false]
{"$rows_left_out":17}
{"sheet":"3 Credibility Index (Single)","index":3,"n_rows":72,"n_cols":4,"rows_kept":72,"cut":false,"hidden":true,"merged":[[62,0,62,1],[65,0,65,1],[66,0,68,0],[34,0,38,0],[40,0,42,0],[44,0,47,0],[48,0,48,1],[49,0,51,0],[52,0,52,1],[39,0,39,1],[63,0,64,0],[43,0,43,1],[53,0,55,0],[56,0,61,0],[33,0,33,1],[30,0,32,0],[0,0,0,1],[1,0,1,1],[2,0,2,1],[3,0,3,1],[10,0,10,1],[15,0,15,1],[20,0,20,1],[25,0,25,1],[29,0,29,1],[11,0,14,0],[16,0,19,0],[21,0,24,0],[26,0,28,0]]}
["Instructions (Click add/subtract button in the left-hand margin to expand or collapse the detailed instructions)"]
["1. For each question, enter the relevant details about the study in Column A."]
["2. Select ONE statement per question based on the details of the study."]
["3. Complete Steps 1 and 2 for Q1 through Q12."]
[]
[]
[]
[]
[]
["Details of the Study","What to look for and think about"]
["Q1. Who conducted the study?",null,1,{"$f":"C11-2","v":-1}]
[]
[]
[]
[]
["Q2. Who published the study?",null,0,{"$f":"C16-2","v":-2}]
[]
[]
[]
[]
{"$rows_left_out":53}
{"sheet":"3 Credibility Index","index":4,"n_rows":68,"n_cols":83,"rows_kept":68,"cut":false,"hidden":false,"merged":[]}
["Relevance and Credibility Indices for Studies of Educational Interventions"]
["Instructions (Click add/subtract button in the left-hand margin to expand or collapse the detailed instructions)"]
["1. For each question below (Q1-11), select one relevant statement that most accurately reflects the study you are reviewing and click on the corresponding radio button."]
["2. The score earned by the study for each question will appear in the blue band at the top of each set of radio buttons."]
["3. Repeat steps 1-2 for each additional study you want to evaluate for credibility."]
["For a detailed explanation of the calculations used in the CI, click here."]
[null,null,{"$f":"IF('1 Summary Table'!B13=\"\",\"\",'1 Summary Table'!B13)","v":""},null,{"$f":"IF('1 Summary Table'!B14=\"\",\"\",'1 Summary Table'!B14)","v":""},null,{"$f":"IF('1 Summary Table'!B15=\"\",\"\",'1 Summary Table'!B15)","v":""},null,{"$f":"IF('1 Summary Table'!B16=\"\",\"\",'1 Summary Table'!B16)","v":""},null,{"$f":"IF('1 Summary Table'!B17=\"\",\"\",'1 Summary Table'!B17)","v":""}]
["Q1. Who conducted the study?",null,{"$f":"IF(BX8=0,\"blank\",IF(BX8=1,-1,IF(BX8=2,0,IF(BX8=3,1,IF(BX8=4,2)))))","v":"blank"},null,{"$f":"IF(BY8=0,\"blank\",IF(BY8=1,-1,IF(BY8=2,0,IF(BY8=3,1,IF(BY8=4,2)))))","v":"blank"},null,{"$f":"IF(CA8=0,\"blank\",IF(CA8=1,-1,IF(CA8=2,0,IF(CA8=3,1,IF(CA8=4,2)))))","v":"blank"},null,{"$f":"IF(CC8=0,\"blank\",IF(CC8=1,-1,IF(CC8=2,0,IF(CC8=3,1,IF(CC8=4,2)))))","v":"blank"},null,{"$f":"IF(CE8=0,\"blank\",IF(CE8=1,-1,IF(CE8=2,0,IF(CE8=3,1,IF(CE8=4,2)))))","v":"blank"},null,null,null,null,null,null,null,null,null,null,null,null,null,null,null,null,null,null,null,null,null,null,null,null,null,null,null,null,null,null,null,null,null,null,null,null,null,null,null,null,null,null,null,null,null,null,null,null,null,null,null,null,null,null,null,null,null,null,null,null,null,null,null,null,0,0,null,0,null,0,null,0]
["It is not clear who conducted the study. "]
["The study was conducted by the program vendor."]
["The study was conducted by an external evaluator hired by the program vendor."]
["The study was conducted by an external evaluator acting as an independent third party, i.e., not paid by the vendor. This may include collaborations between the evaluator and implementing partners such as school districts or other educational or research institutions, but excluding the program vendor. The key distinction is that those conducting and/or commissioning the evaluation should not stand to make a profit from the sale of the product/ intervention being tested."]
["Q2. Who published the study?",null,{"$f":"IF(BX13=0,\"blank\",IF(BX13=1,-1,IF(BX13=2,0,IF(BX13=3,1,IF(BX13=4,2)))))","v":"blank"},null,{"$f":"IF(BY13=0,\"blank\",IF(BY13=1,-1,IF(BY13=2,0,IF(BY13=3,1,IF(BY13=4,2)))))","v":"blank"},null,{"$f":"IF(CA13=0,\"blank\",IF(CA13=1,-1,IF(CA13=2,0,IF(CA13=3,1,IF(CA13=4,2)))))","v":"blank"},null,{"$f":"IF(CC13=0,\"blank\",IF(CC13=1,-1,IF(CC13=2,0,IF(CC13=3,1,IF(CC13=4,2)))))","v":"blank"},null,{"$f":"IF(CE13=0,\"blank\",IF(CE13=1,-1,IF(CE13=2,0,IF(CE13=3,1,IF(CE13=4,2)))))","v":"blank"},null,null,null,null,null,null,null,null,null,null,null,null,null,null,null,null,null,null,null,null,null,null,null,null,null,null,null,null,null,null,null,null,null,null,null,null,null,null,null,null,null,null,null,null,null,null,null,null,null,null,null,null,null,null,null,null,null,null,null,null,null,null,null,null,0,0,null,0,null,0,null,0]
["It is not clear where the study was published. "]
["The study was published by the vendor."]
["The study was published by a third party (i.e., other than the vendor) but not a peer-reviewed journal, e.g., a university, research organization, school district or other government agency. Keep in mind some technical reports are also later published in a peer-reviewed journal, so you may wish to check Google Scholar to see if there is a later published version."]
["The study was published in a peer-reviewed journal. "]
["Q3. Length of time participants are exposed to the educational program/strategy being studied",null,{"$f":"IF(BX18=0,\"blank\",IF(BX18=1,-1,IF(BX18=2,0,IF(BX18=3,1,IF(BX18=4,2)))))","v":"blank"},null,{"$f":"IF(BY18=0,\"blank\",IF(BY18=1,-1,IF(BY18=2,0,IF(BY18=3,1,IF(BY18=4,2)))))","v":"blank"},null,{"$f":"IF(CA18=0,\"blank\",IF(CA18=1,-1,IF(CA18=2,0,IF(CA18=3,1,IF(CA18=4,2)))))","v":"blank"},null,{"$f":"IF(CC18=0,\"blank\",IF(CC18=1,-1,IF(CC18=2,0,IF(CC18=3,1,IF(CC18=4,2)))))","v":"blank"},null,{"$f":"IF(CE18=0,\"blank\",IF(CE18=1,-1,IF(CE18=2,0,IF(CE18=3,1,IF(CE18=4,2)))))","v":"blank"},null,null,null,null,null,null,null,null,null,null,null,null,null,null,null,null,null,null,null,null,null,null,null,null,null,null,null,null,null,null,null,null,null,null,null,null,null,null,null,null,null,null,null,null,null,null,null,null,null,null,null,null,null,null,null,null,null,null,null,null,null,null,null,null,0,0,null,0,null,0,null,0]
["Length of exposure is not clear from the study. "]
["Length of exposure is too short to make a difference."]
{"$rows_left_out":49}
{"sheet":"4 Background & References","index":5,"n_rows":38,"n_cols":3,"rows_kept":38,"cut":false,"hidden":false,"merged":[[0,0,0,1],[1,0,1,1],[34,0,34,1],[37,0,37,1],[36,0,36,1],[35,0,35,1],[2,0,2,1],[3,0,3,1],[5,0,5,1],[6,0,6,1],[7,0,7,1]]}
["Relevance and Credibility Indices for Studies of Educational Interventions"]
["What are the Relevance and Credibility Indices1?"]
["In order to help you assess whether existing research studies are credible and relevant to your own educational context, our reserach team has developed two indices, the Relevance Index and the Credibility Index. These are essentially rubrics that can help decision-makers evaluate existing studies of educational programs, strategies or interventions to determine how seriously to take the findings and whether they can safely assume the findings might apply in their own context.* \n\nThe Relevance Index helps decision-makers determine how well a study’s findings apply in their own context by assessing the extent to which various characteristics of the study population and context are similar to the decision-maker’s own context.\n\nThe Credibility Index helps decision-makers assess how seriously to take the findings of a study by scoring it on the quality of study design.  "]
["*Note that these indices are designed to be used to assess studies which focus on single investigations rather than for studies which summarize the results of many investigations, such as literature reviews or meta-analyses. While such summaries are useful for providing a general idea of “what works,” it would be hard to assess the relevance of such overviews to your own context."]
[]
["How to use this Worksheet to evaluate a research study:"]
["•Before reading a study you want to consider as evidence, look over the items in each index (Relevance and Credibility) so you know what to look out for. "]
["•To find the information in the study that you will need for completing this worksheet, look for section headings in the study that use terms like “Methods” or “Study Design,” “Measures,” and “Sample” or “Setting.” Search functions in a Word or PDF document can help with this (e.g., Ctrl F)."]
[]
["Key terms:"]
["Comparison group","A comparison group is a group that did not participate in a program and whose results on the outcome of interest can be compared with those of the group that did participate in the program. The key challenge in a good efficacy study is to find a comparison group that closely resembles program participants, meaning both groups should be similar on average across important characteristics, such as student demographics or school characteristics. "]
["Measures","Measures are the items in a research study to which the participants respond2, which are used to assess performance on the outcomes of interest."]
["Outcome","An outcome is a change or impact caused by the program or strategy being evaluated, or it could be a characteristic of the respondents you want to measure.3 An outcome of a reading program for third graders in an elementary school might be to raise reading skills among third grade students."]
["Sample","A sample is a subset of a population, for example, a subset of the students/teachers/schools that make up a target population for an evaluation.  \nA sample is representative if the sample is similar to the target population on all important characteristics. "]
["Statistical power","Statistical power: The probability that the estimate of the program effect will be found statistically significant if a given effect size is determined to have occurred."]
["Sample size","Sample Size: The number of units (e.g., students/teachers/schools) in a sample."]
["Target population","The target population of a study is the complete collection of students/teachers/schools or other units that we want to study or consider.4  For example, the target population of a study on algebra skills of high school students in a particular school district may be all 150,000 students in every high school in the district."]
[]
["Acronyms:"]
["ELL:","English Language Learner"]
{"$rows_left_out":19}
{"sheet":"Reference Table","index":6,"n_rows":35,"n_cols":17,"rows_kept":35,"cut":false,"hidden":true,"merged":[[1,16,2,16],[1,6,2,6],[1,15,2,15]]}
["RI Importance/Own Rating",null,null,null,null,"RI Interpretation",null,null,"RI Decision",null,null,"CI"]
["not at all/unavailable","slightly","moderately","very",null,"Relevance Index","Relevance Rating",null,"Yes","No",null,"Who conducted the study?","Max Points: 2",null,"Credibility Index","Credibility Rating","Credibility Parameter"]
[null,null,null,null,null,"( = Total points for this study/Total possible score x 100)",null,null,null,null,null,4,-1,null,"(Total Points for Parts I, II, III, IV)"]
[null,null,null,null,null,"Less than 30%","Low Relevance",null,null,null,null,"The study was conducted by the program vendor.",0,null,"Less than 10","Low credibility",0.2]
[null,null,null,null,null,"31 - 69%","Moderate Relevance",null,null,null,null,"The study was conducted by an external evaluator hired by the program vendor.",1,null,"10-19","Moderate credibility",0.6]
[null,null,null,null,null,"70% or higher","High Relevance",null,null,null,null,"The study was conducted by an external evaluator acting as an independent third party, i.e., not paid by the vendor.[1] ",2,null,"20-27","High credibility",1]
[]
[null,null,null,null,null,null,null,null,null,null,null,"Who published the study?","Max Points: 2"]
[null,null,null,null,null,null,null,null,null,null,null,"It is not clear where the study was published. ",-1]
[null,null,null,null,null,null,null,null,null,null,null,"The study was published by the vendor.",0]
[null,null,null,null,null,null,null,null,null,null,null,"The study was published by a third party (i.e., other than the vendor) but not a peer-reviewed journal, e.g., a university, research organization, school district or other government agency. Keep in mind some technical reports are also later published in a peer-reviewed journal, so you may wish to check Google Scholar to see if there is a later published version.",1]
[null,null,null,null,null,null,null,null,null,null,null,"The study was published in a peer-reviewed journal.[2] ",2]
[]
[null,null,null,null,null,null,null,null,null,null,null,"Length of time participants are exposed to the educational program/strategy being studied","MAX POINTS 2"]
[null,null,null,null,null,null,null,null,null,null,null,"Length of exposure is not clear from the study. ",-1]
[null,null,null,null,null,null,null,null,null,null,null,"Length of exposure is too short to make a difference.",0]
[null,null,null,null,null,null,null,null,null,null,null,"Length of exposure is too long to reflect likely effect in regular practice.",1]
[null,null,null,null,null,null,null,null,null,null,null,"Length of exposure is about right.",2]
[]
[null,null,null,null,null,null,null,null,null,null,null,"Components of the program: Is it clear what program participants were expected to do compared with business as usual conditions?","MAX POINTS: 2"]
{"$rows_left_out":15}